Reaction Details
TargetHistamine H3 receptor
LigandBDBM50243121
Substrate/Competitorn/a
Meas. Tech.ChEMBL_491618 (CHEMBL945389)
Ki 6±n/a nM
Citation Santora, VJCovel, JAHayashi, RHofilena, BJIbarra, JBPulley, MDWeinhouse, MISemple, GRen, APereira, GEdwards, JESuarez, MFrazer, JThomsen, WHauser, ELorea, JGrottick, AJ Novel H3 receptor antagonists with improved pharmacokinetic profiles. Bioorg Med Chem Lett18:4133-6 (2008) 
 
Histamine H3 receptor
Name:Histamine H3 receptor
Type:G Protein-Coupled Receptor (GPCR)
Mol. Mass.:48607.98
Organism:Rattus norvegicus (rat)
Description:n/a
Residue:445
BDBM50243121
NameBDBM50243121
Synonyms:2-hydroxy-1-((3aR,6aR)-6-(4-(2-(pyrrolidin-1-yl)ethyl)phenyl)-1,3a,4,6a-tetrahydrocyclopenta[c]pyrrol-2(1H)-yl)ethanone | CHEMBL487265
TypeSmall organic molecule
Emp. Form.C21H28N2O2
Mol. Mass.340.4592
SMILESOCC(=O)N1C[C@@H]2CC=C([C@@H]2C1)c1ccc(CCN2CCCC2)cc1