Reaction Details
TargetTransporter
LigandBDBM50010874
Substrate/Competitorn/a
Meas. Tech.ChEMBL_487427 (CHEMBL1020882)
IC50 300±n/a nM
Citation Mahaney, PEGavrin, LKTrybulski, EJStack, GPVu, TACohn, STYe, FBelardi, JKSantilli, AASabatucci, JPLeiter, JJohnston, GHBray, JABurroughs, KDCosmi, SALeventhal, LKoury, EJZhang, YMugford, CAHo, DMRosenzweig-Lipson, SJPlatt, BSmith, VADeecher, DC Structure-activity relationships of the cycloalkanol ethylamine scaffold: discovery of selective norepinephrine reuptake inhibitors. J Med Chem51:4038-49 (2008) 
 
Transporter
Name:Transporter
Type:Multi-pass membrane protein
Mol. Mass.:69236.90
Organism:Rattus norvegicus (rat)
Description:Q63380
Residue:617
BDBM50010874
NameBDBM50010874
Synonyms:1-(1-(4-chlorophenyl)-2-(dimethylamino)ethyl)cyclohexanol CHEMBL420644
TypeSmall organic molecule
Emp. Form.C16H24ClNO
Mol. Mass.281.821
SMILESCN(C)CC(c1ccc(Cl)cc1)C1(O)CCCCC1