Reaction Details
TargetPotassium voltage-gated channel subfamily H member 2
LigandBDBM50252044
Substrate/Competitorn/a
Meas. Tech.ChEMBL_487847 (CHEMBL1020033)
IC50 14600±n/a nM
Citation Cox, CDColeman, PJBreslin, MJWhitman, DBGarbaccio, RMFraley, MEBuser, CAWalsh, ESHamilton, KSchaber, MDLobell, RBTao, WDavide, JPDiehl, REAbrams, MTSouth, VJHuber, HETorrent, MPrueksaritanont, TLi, CSlaughter, DEMahan, EFernandez-Metzler, CYan, YKuo, LCKohl, NEHartman, GD Kinesin spindle protein (KSP) inhibitors. 9. Discovery of (2S)-4-(2,5-difluorophenyl)-n-[(3R,4S)-3-fluoro-1-methylpiperidin-4-yl]-2-(hydroxymethyl)-N-methyl-2-phenyl-2,5-dihydro-1H-pyrrole-1-carboxamide (MK-0731) for the treatment of taxane-refractory cancer. J Med Chem51:4239-52 (2008) 
 
Potassium voltage-gated channel subfamily H member 2
Name:Potassium voltage-gated channel subfamily H member 2
Type:Multi-pass membrane protein
Mol. Mass.:126672.65
Organism:Homo sapiens (Human)
Description:Q12809
Residue:1159
BDBM50252044
NameBDBM50252044
Synonyms:(2S)-4-(2,5-Difluorophenyl)-2-(hydroxymethyl)-N-methyl-N-(1-methylpiperidin-4-yl)-2-phenyl-2,5-dihydro-1H-pyrrole-1-carboxamide | CHEMBL479796
TypeSmall organic molecule
Emp. Form.C25H29F2N3O2
Mol. Mass.441.5135
SMILESCN(C1CCN(C)CC1)C(=O)N1CC(=C[C@@]1(CO)c1ccccc1)c1cc(F)ccc1F