Reaction Details
TargetFructose-1,6-bisphosphatase 1
LigandBDBM50272991
Substrate/Competitorn/a
Meas. Tech.ChEMBL_513688 (CHEMBL974538)
IC50 8±n/a nM
Citation Hebeisen, PKuhn, BKohler, PGubler, MHuber, WKitas, ESchott, BBenz, JJoseph, CRuf, A Allosteric FBPase inhibitors gain 10(5) times in potency when simultaneously binding two neighboring AMP sites. Bioorg Med Chem Lett18:4708-12 (2008) 
 
Fructose-1,6-bisphosphatase 1
Name:Fructose-1,6-bisphosphatase 1
Type:Protein
Mol. Mass.:36843.58
Organism:Homo sapiens (Human)
Description:Liver FBPase (P09467)
Residue:338
BDBM50272991
NameBDBM50272991
Synonyms:1-[(3-chlorobenzene)sulfonyl]-3-[6-({[(3-chlorobenzene)sulfonyl]carbamoyl}amino)hexyl]urea | CHEMBL456977
TypeSmall organic molecule
Emp. Form.C20H24Cl2N4O6S2
Mol. Mass.551.464
SMILESClc1cccc(c1)S(=O)(=O)NC(=O)NCCCCCCNC(=O)NS(=O)(=O)c1cccc(Cl)c1