Reaction Details
TargetGonadotropin-releasing hormone receptor
LigandBDBM50272666
Substrate/Competitorn/a
Meas. Tech.ChEMBL_510058 (CHEMBL995201)
Ki 1.2±n/a nM
Citation Regan, CFGuo, ZChen, YHuang, CQChen, MJiang, WRueter, JKCoon, TChen, CSaunders, JBrown, MSBetz, SFStruthers, RSYang, CWen, JMadan, AZhu, YF Zwitterionic uracil derivatives as potent GnRH receptor antagonists with improved pharmaceutical properties. Bioorg Med Chem Lett18:4503-7 (2008) 
 
Gonadotropin-releasing hormone receptor
Name:Gonadotropin-releasing hormone receptor
Type:Enzyme
Mol. Mass.:37749.45
Organism:Homo sapiens (Human)
Description:P30968
Residue:328
BDBM50272666
NameBDBM50272666
Synonyms:(R)-5-(3-(1-(2-fluoro-6-(trifluoromethyl)benzyl)-6-methyl-3-(2-(methylamino)-2-phenylethyl)-2,4-dioxo-1,2,3,4-tetrahydropyrimidin-5-yl)-2-fluorophenoxy)pentanoic acid | CHEMBL451916
TypeSmall organic molecule
Emp. Form.C33H32F5N3O5
Mol. Mass.645.6163
SMILESCN[C@@H](Cn1c(=O)c(c(C)n(Cc2c(F)cccc2C(F)(F)F)c1=O)-c1cccc(OCCCCC(O)=O)c1F)c1ccccc1