Reaction Details
TargetCyclin-dependent kinase 1
LigandBDBM50245443
Substrate/Competitorn/a
Meas. Tech.ChEMBL_512836 (CHEMBL972549)
IC50>100000±n/a nM
Citation Hughes, TVXu, GWetter, SKConnolly, PJEmanuel, SLKarnachi, PPollack, SRPandey, NAdams, MMoreno-Mazza, SMiddleton, SAGreenberger, LM A novel 5-[1,3,4-oxadiazol-2-yl]-N-aryl-4,6-pyrimidine diamine having dual EGFR/HER2 kinase activity: design, synthesis, and biological activity. Bioorg Med Chem Lett18:4896-9 (2008) 
 
Cyclin-dependent kinase 1
Name:Cyclin-dependent kinase 1
Type:Enzyme Subunit
Mol. Mass.:34101.08
Organism:Homo sapiens (Human)
Description:P06493
Residue:297
BDBM50245443
NameBDBM50245443
Synonyms:4-amino-6-(4-(benzyloxy)-3-chlorophenylamino)-N-(4-methoxyphenyl)pyrimidine-5-carboxamide | CHEMBL472383
TypeSmall organic molecule
Emp. Form.C25H22ClN5O3
Mol. Mass.475.927
SMILESCOc1ccc(NC(=O)c2c(N)ncnc2Nc2ccc(OCc3ccccc3)c(Cl)c2)cc1