Reaction Details
TargetOxysterols receptor LXR-beta
LigandBDBM50252816
Substrate/Competitorn/a
Meas. Tech.ChEMBL_539729 (CHEMBL1032355)
IC50 15±n/a nM
Citation Chao, EYCaravella, JAWatson, MACampobasso, NGhisletti, SBillin, ANGalardi, CWang, PLaffitte, BAIannone, MAGoodwin, BJNichols, JAParks, DJStewart, EWiethe, RWWilliams, SPSmallwood, APearce, KHGlass, CKWillson, TMZuercher, WJCollins, JL Structure-guided design of N-phenyl tertiary amines as transrepression-selective liver X receptor modulators with anti-inflammatory activity. J Med Chem51:5758-65 (2008) 
 
Oxysterols receptor LXR-beta
Name:Oxysterols receptor LXR-beta
Type:Enzyme Catalytic Domain
Mol. Mass.:50978.79
Organism:Homo sapiens (Human)
Description:P55055
Residue:460
BDBM50252816
NameBDBM50252816
Synonyms:2-(4-{Butyl[3-(2-hydroxyethoxy)benzyl]amino}phenyl)-1,1,1,3,3,3-hexafluoropropan-2-ol | CHEMBL494471
TypeSmall organic molecule
Emp. Form.C22H25F6NO2
Mol. Mass.449.4298
SMILESCCCCN(Cc1cccc(CCO)c1)c1ccc(cc1)C(O)(C(F)(F)F)C(F)(F)F