Reaction Details
TargetOxysterols receptor LXR-beta
LigandBDBM50252851
Substrate/Competitorn/a
Meas. Tech.ChEMBL_539729 (CHEMBL1032355)
IC50 40±n/a nM
Citation Chao, EYCaravella, JAWatson, MACampobasso, NGhisletti, SBillin, ANGalardi, CWang, PLaffitte, BAIannone, MAGoodwin, BJNichols, JAParks, DJStewart, EWiethe, RWWilliams, SPSmallwood, APearce, KHGlass, CKWillson, TMZuercher, WJCollins, JL Structure-guided design of N-phenyl tertiary amines as transrepression-selective liver X receptor modulators with anti-inflammatory activity. J Med Chem51:5758-65 (2008) 
 
Oxysterols receptor LXR-beta
Name:Oxysterols receptor LXR-beta
Type:Enzyme Catalytic Domain
Mol. Mass.:50978.79
Organism:Homo sapiens (Human)
Description:P55055
Residue:460
BDBM50252851
NameBDBM50252851
Synonyms:2-[(Butyl{4-[2,2,2-trifluoro-1-hydroxy-1-(trifluoromethyl)ethyl]phenyl}amino)methyl]phenol | CHEMBL492637
TypeSmall organic molecule
Emp. Form.C20H21F6NO2
Mol. Mass.421.3767
SMILESCCCCN(Cc1ccccc1O)c1ccc(cc1)C(O)(C(F)(F)F)C(F)(F)F