Reaction Details
TargetOxysterols receptor LXR-alpha
LigandBDBM19992
Substrate/Competitorn/a
Meas. Tech.ChEMBL_539728 (CHEMBL1032354)
IC50 235±n/a nM
Citation Chao, EYCaravella, JAWatson, MACampobasso, NGhisletti, SBillin, ANGalardi, CWang, PLaffitte, BAIannone, MAGoodwin, BJNichols, JAParks, DJStewart, EWiethe, RWWilliams, SPSmallwood, APearce, KHGlass, CKWillson, TMZuercher, WJCollins, JL Structure-guided design of N-phenyl tertiary amines as transrepression-selective liver X receptor modulators with anti-inflammatory activity. J Med Chem51:5758-65 (2008) 
 
Oxysterols receptor LXR-alpha
Name:Oxysterols receptor LXR-alpha
Type:Enzyme Catalytic Domain
Mol. Mass.:50403.85
Organism:Homo sapiens (Human)
Description:Q13133
Residue:447
BDBM19992
NameBDBM19992
Synonyms:2-[3-[3-[[2-chloro-3-(trifluoromethyl)phenyl]methyl-[2,2-di(phenyl)ethyl]amino]propoxy]phenyl]acetic acid CHEMBL59030 GW3965 US10669296, Compound GW3965 | US10945978, Compound 2
TypeSmall organic molecule
Emp. Form.C33H31ClF3NO3
Mol. Mass.582.052
SMILESOC(=O)Cc1cccc(OCCCN(CC(c2ccccc2)c2ccccc2)Cc2cccc(c2Cl)C(F)(F)F)c1