Reaction Details
TargetOxysterols receptor LXR-alpha
LigandBDBM50252967
Substrate/Competitorn/a
Meas. Tech.ChEMBL_539728 (CHEMBL1032354)
IC50 170±n/a nM
Citation Chao, EYCaravella, JAWatson, MACampobasso, NGhisletti, SBillin, ANGalardi, CWang, PLaffitte, BAIannone, MAGoodwin, BJNichols, JAParks, DJStewart, EWiethe, RWWilliams, SPSmallwood, APearce, KHGlass, CKWillson, TMZuercher, WJCollins, JL Structure-guided design of N-phenyl tertiary amines as transrepression-selective liver X receptor modulators with anti-inflammatory activity. J Med Chem51:5758-65 (2008) 
 
Oxysterols receptor LXR-alpha
Name:Oxysterols receptor LXR-alpha
Type:Enzyme Catalytic Domain
Mol. Mass.:50403.85
Organism:Homo sapiens (Human)
Description:Q13133
Residue:447
BDBM50252967
NameBDBM50252967
Synonyms:2-{4-[Butyl(3,5-dichloro-4-methoxybenzyl)amino]phenyl}-1,1,1,3,3,3-hexafluoropropan-2-ol | CHEMBL492421
TypeSmall organic molecule
Emp. Form.C21H21Cl2F6NO2
Mol. Mass.504.293
SMILESCCCCN(Cc1cc(Cl)c(OC)c(Cl)c1)c1ccc(cc1)C(O)(C(F)(F)F)C(F)(F)F