Reaction Details
TargetPlasmepsin II
LigandBDBM50273740
Substrate/Competitorn/a
Meas. Tech.ChEMBL_536036 (CHEMBL991606)
Ki 23±n/a nM
Citation Hidaka, KKimura, TRuben, AJUemura, TKamiya, MKiso, AOkamoto, TTsuchiya, YHayashi, YFreire, EKiso, Y Antimalarial activity enhancement in hydroxymethylcarbonyl (HMC) isostere-based dipeptidomimetics targeting malarial aspartic protease plasmepsin. Bioorg Med Chem16:10049-60 (2008) 
 
Plasmepsin II
Name:Plasmepsin II
Type:Enzyme
Mol. Mass.:51482.09
Organism:Plasmodium falciparum
Description:P46925
Residue:453
BDBM50273740
NameBDBM50273740
Synonyms:(R)-N-[(1S,2R)-2-Hydroxyindan-1-yl]-3-[(2S,3S)-3-(2,6-diisopropylphenoxyacetyl)amino-2-hydroxy-4-phenylbutanoyl]-5,5-dimethyl-1,3-thiazolidine-4-carboxamide KNI-10152
TypeSmall organic molecule
Emp. Form.C39H49N3O6S
Mol. Mass.687.888
SMILESCC(C)c1cccc(C(C)C)c1OCC(=O)N[C@@H](Cc1ccccc1)[C@H](O)C(=O)N1CSC(C)(C)[C@H]1C(=O)N[C@@H]1[C@H](O)Cc2ccccc12