Reaction Details
TargetAngiopoietin-1 receptor
LigandBDBM50266117
Substrate/Competitorn/a
Meas. Tech.ChEMBL_540209 (CHEMBL1029838)
IC50 460±n/a nM
Citation Cee, VJCheng, ACRomero, KBellon, SMohr, CWhittington, DABak, ABready, JCaenepeel, SCoxon, ADeak, HLFretland, JGu, YHodous, BLHuang, XKim, JLLin, JLong, AMNguyen, HOlivieri, PRPatel, VFWang, LZhou, YHughes, PGeuns-Meyer, S Pyridyl-pyrimidine benzimidazole derivatives as potent, selective, and orally bioavailable inhibitors of Tie-2 kinase. Bioorg Med Chem Lett19:424-7 (2008) 
 
Angiopoietin-1 receptor
Name:Angiopoietin-1 receptor
Type:Enzyme
Mol. Mass.:125835.70
Organism:Homo sapiens (Human)
Description:Q02763
Residue:1124
BDBM50266117
NameBDBM50266117
Synonyms:1-(3-methyl-4-(3-(2-(methylamino)pyrimidin-4-yl)pyridin-2-yloxy)phenyl)-3-phenylurea | CHEMBL517559
TypeSmall organic molecule
Emp. Form.C24H22N6O2
Mol. Mass.426.4705
SMILESCNc1nccc(n1)-c1cccnc1Oc1ccc(NC(=O)Nc2ccccc2)cc1C