Reaction Details
TargetVascular endothelial growth factor receptor 2
LigandBDBM50266150
Substrate/Competitorn/a
Meas. Tech.ChEMBL_540210 (CHEMBL1029839)
IC50 1570±n/a nM
Citation Cee, VJCheng, ACRomero, KBellon, SMohr, CWhittington, DABak, ABready, JCaenepeel, SCoxon, ADeak, HLFretland, JGu, YHodous, BLHuang, XKim, JLLin, JLong, AMNguyen, HOlivieri, PRPatel, VFWang, LZhou, YHughes, PGeuns-Meyer, S Pyridyl-pyrimidine benzimidazole derivatives as potent, selective, and orally bioavailable inhibitors of Tie-2 kinase. Bioorg Med Chem Lett19:424-7 (2008) 
 
Vascular endothelial growth factor receptor 2
Name:Vascular endothelial growth factor receptor 2
Type:Receptor Tyrosine Kinase
Mol. Mass.:151510.97
Organism:Homo sapiens (Human)
Description:P35968
Residue:1356
BDBM50266150
NameBDBM50266150
Synonyms:7-methyl-N-(4-(3-(2-(methylamino)pyrimidin-4-yl)pyridin-2-yloxy)naphthalen-1-yl)-1H-benzo[d]imidazol-2-amine | CHEMBL457100
TypeSmall organic molecule
Emp. Form.C28H23N7O
Mol. Mass.473.5285
SMILESCNc1nccc(n1)-c1cccnc1Oc1ccc(Nc2nc3c(C)cccc3[nH]2)c2ccccc12