Reaction Details
TargetVascular endothelial growth factor receptor 2
LigandBDBM50266149
Substrate/Competitorn/a
Meas. Tech.ChEMBL_540210 (CHEMBL1029839)
IC50 40±n/a nM
Citation Cee, VJCheng, ACRomero, KBellon, SMohr, CWhittington, DABak, ABready, JCaenepeel, SCoxon, ADeak, HLFretland, JGu, YHodous, BLHuang, XKim, JLLin, JLong, AMNguyen, HOlivieri, PRPatel, VFWang, LZhou, YHughes, PGeuns-Meyer, S Pyridyl-pyrimidine benzimidazole derivatives as potent, selective, and orally bioavailable inhibitors of Tie-2 kinase. Bioorg Med Chem Lett19:424-7 (2008) 
 
Vascular endothelial growth factor receptor 2
Name:Vascular endothelial growth factor receptor 2
Type:Receptor Tyrosine Kinase
Mol. Mass.:151510.97
Organism:Homo sapiens (Human)
Description:P35968
Residue:1356
BDBM50266149
NameBDBM50266149
Synonyms:1-(4-(3-(2-(methylamino)pyrimidin-4-yl)pyridin-2-yloxy)naphthalen-1-yl)-3-phenylurea | CHEMBL457099
TypeSmall organic molecule
Emp. Form.C27H22N6O2
Mol. Mass.462.5026
SMILESCNc1nccc(n1)-c1cccnc1Oc1ccc(NC(=O)Nc2ccccc2)c2ccccc12