Reaction Details
TargetAurora kinase A
LigandBDBM50266221
Substrate/Competitorn/a
Meas. Tech.ChEMBL_540214 (CHEMBL1029843)
IC50 28±n/a nM
Citation Cee, VJCheng, ACRomero, KBellon, SMohr, CWhittington, DABak, ABready, JCaenepeel, SCoxon, ADeak, HLFretland, JGu, YHodous, BLHuang, XKim, JLLin, JLong, AMNguyen, HOlivieri, PRPatel, VFWang, LZhou, YHughes, PGeuns-Meyer, S Pyridyl-pyrimidine benzimidazole derivatives as potent, selective, and orally bioavailable inhibitors of Tie-2 kinase. Bioorg Med Chem Lett19:424-7 (2008) 
 
Aurora kinase A
Name:Aurora kinase A
Type:Serine/threonine-protein kinase
Mol. Mass.:45830.98
Organism:Homo sapiens (Human)
Description:O14965
Residue:403
BDBM50266221
NameBDBM50266221
Synonyms:CHEMBL458023 N-[3-methyl-4-({3-[2-(methylamino)pyrimidin-4-yl]pyridin-2-yl}oxy)naphthalen-1-yl]-1H-benzimidazol-2-amine
TypeSmall organic molecule
Emp. Form.C28H23N7O
Mol. Mass.473.5285
SMILESCNc1nccc(n1)-c1cccnc1Oc1c(C)cc(Nc2nc3ccccc3[nH]2)c2ccccc12