Reaction Details
TargetRetinoic acid receptor RXR-gamma
LigandBDBM50256174
Substrate/Competitorn/a
Meas. Tech.ChEMBL_515111 (CHEMBL1024633)
IC50 3800±n/a nM
Citation Morishita, KYakushiji, NOhsawa, FTakamatsu, KMatsuura, NMakishima, MKawahata, MYamaguchi, KTai, ASasaki, KKakuta, H Replacing alkyl sulfonamide with aromatic sulfonamide in sulfonamide-type RXR agonists favors switch towards antagonist activity. Bioorg Med Chem Lett19:1001-3 (2009) 
 
Retinoic acid receptor RXR-gamma
Name:Retinoic acid receptor RXR-gamma
Type:PROTEIN
Mol. Mass.:50878.26
Organism:Homo sapiens (Human)
Description:ChEMBL_197216
Residue:463
BDBM50256174
NameBDBM50256174
Synonyms:6-(4-methyl-N-(5,5,8,8-tetramethyl-5,6,7,8-tetrahydronaphthalen-2-yl)phenylsulfonamido)nicotinic acid | CHEMBL521442
TypeSmall organic molecule
Emp. Form.C27H30N2O4S
Mol. Mass.478.603
SMILESCc1ccc(cc1)S(=O)(=O)N(c1ccc2c(c1)C(C)(C)CCC2(C)C)c1ccc(cn1)C(O)=O