Reaction Details
TargetCytochrome P450 2D6
LigandBDBM50255812
Substrate/Competitorn/a
Meas. Tech.ChEMBL_515428 (CHEMBL1028887)
Ki 54.7±n/a nM
Citation Ponte-Sucre, AGulder, TWegehaupt, AAlbert, CRikanovic, CSchaeflein, LFrank, ASchultheis, MUnger, MHolzgrabe, UBringmann, GMoll, H Structure-activity relationship and studies on the molecular mechanism of leishmanicidal N,C-coupled arylisoquinolinium salts. J Med Chem52:626-36 (2009) 
 
Cytochrome P450 2D6
Name:Cytochrome P450 2D6
Type:Protein
Mol. Mass.:55774.82
Organism:Homo sapiens (Human)
Description:P10635
Residue:497
BDBM50255812
NameBDBM50255812
Synonyms:CHEMBL481022 | N-(4'-i-Propylphenyl)-6,8-dimethoxy-1,3-dimethylisoquinoliniumTrifluoroacetate
TypeSmall organic molecule
Emp. Form.C22H26NO2
Mol. Mass.336.4468
SMILESCOc1cc(OC)c2c(C)[n+](c(C)cc2c1)-c1ccc(cc1)C(C)C