Reaction Details
TargetSphingosine 1-phosphate receptor 1
LigandBDBM50249294
Substrate/Competitorn/a
Meas. Tech.ChEMBL_499713 (CHEMBL980648)
IC50 0.2±n/a nM
Citation Evindar, GSatz, ALBernier, SGKavarana, MJDoyle, ELorusso, JTaghizadeh, NHalley, KHutchings, AKelley, MSWright, ADSaha, AKHannig, GMorgan, BAWestlin, WF Synthesis and evaluation of arylalkoxy- and biarylalkoxy-phenylamide and phenylimidazoles as potent and selective sphingosine-1-phosphate receptor subtype-1 agonists. Bioorg Med Chem Lett19:2315-9 (2009) 
 
Sphingosine 1-phosphate receptor 1
Name:Sphingosine 1-phosphate receptor 1
Type:Enzyme
Mol. Mass.:42836.02
Organism:Homo sapiens (Human)
Description:P21453
Residue:382
BDBM50249294
NameBDBM50249294
Synonyms:(R)-2-amino-2-(4-(4-(5-phenylpentyloxy)phenyl)-1H-imidazol-2-yl)propyl dihydrogen phosphate | CHEMBL470511
TypeSmall organic molecule
Emp. Form.C23H30N3O5P
Mol. Mass.459.4752
SMILESC[C@](N)(COP(O)(O)=O)c1nc(c[nH]1)-c1ccc(OCCCCCc2ccccc2)cc1