Reaction Details
TargetSphingosine 1-phosphate receptor 4
LigandBDBM50249113
Substrate/Competitorn/a
Meas. Tech.ChEMBL_499715 (CHEMBL980650)
IC50 10.3±n/a nM
Citation Evindar, GSatz, ALBernier, SGKavarana, MJDoyle, ELorusso, JTaghizadeh, NHalley, KHutchings, AKelley, MSWright, ADSaha, AKHannig, GMorgan, BAWestlin, WF Synthesis and evaluation of arylalkoxy- and biarylalkoxy-phenylamide and phenylimidazoles as potent and selective sphingosine-1-phosphate receptor subtype-1 agonists. Bioorg Med Chem Lett19:2315-9 (2009) 
 
Sphingosine 1-phosphate receptor 4
Name:Sphingosine 1-phosphate receptor 4
Type:G Protein-Coupled Receptor (GPCR)
Mol. Mass.:41647.39
Organism:Homo sapiens (Human)
Description:n/a
Residue:384
BDBM50249113
NameBDBM50249113
Synonyms:(S)-2-amino-2-methyl-3-oxo-3-(4-(4-phenylbutoxy)phenylamino)propyl dihydrogen phosphate | CHEMBL514302
TypeSmall organic molecule
Emp. Form.C20H27N2O6P
Mol. Mass.422.4119
SMILESC[C@](N)(COP(O)(O)=O)C(=O)Nc1ccc(OCCCCc2ccccc2)cc1