Reaction Details
TargetSphingosine 1-phosphate receptor 4
LigandBDBM50249154
Substrate/Competitorn/a
Meas. Tech.ChEMBL_499715 (CHEMBL980650)
IC50 6.15±n/a nM
Citation Evindar, GSatz, ALBernier, SGKavarana, MJDoyle, ELorusso, JTaghizadeh, NHalley, KHutchings, AKelley, MSWright, ADSaha, AKHannig, GMorgan, BAWestlin, WF Synthesis and evaluation of arylalkoxy- and biarylalkoxy-phenylamide and phenylimidazoles as potent and selective sphingosine-1-phosphate receptor subtype-1 agonists. Bioorg Med Chem Lett19:2315-9 (2009) 
 
Sphingosine 1-phosphate receptor 4
Name:Sphingosine 1-phosphate receptor 4
Type:G Protein-Coupled Receptor (GPCR)
Mol. Mass.:41647.39
Organism:Homo sapiens (Human)
Description:n/a
Residue:384
BDBM50249154
NameBDBM50249154
Synonyms:(S)-2-amino-3-(4-(biphenyl-4-ylmethoxy)phenylamino)-2-methyl-3-oxopropyl dihydrogen phosphate | CHEMBL473563
TypeSmall organic molecule
Emp. Form.C23H25N2O6P
Mol. Mass.456.4282
SMILESC[C@](N)(COP(O)(O)=O)C(=O)Nc1ccc(OCc2ccc(cc2)-c2ccccc2)cc1