Reaction Details
TargetSphingosine 1-phosphate receptor 5
LigandBDBM50249264
Substrate/Competitorn/a
Meas. Tech.ChEMBL_499716 (CHEMBL980651)
IC50 99.8±n/a nM
Citation Evindar, GSatz, ALBernier, SGKavarana, MJDoyle, ELorusso, JTaghizadeh, NHalley, KHutchings, AKelley, MSWright, ADSaha, AKHannig, GMorgan, BAWestlin, WF Synthesis and evaluation of arylalkoxy- and biarylalkoxy-phenylamide and phenylimidazoles as potent and selective sphingosine-1-phosphate receptor subtype-1 agonists. Bioorg Med Chem Lett19:2315-9 (2009) 
 
Sphingosine 1-phosphate receptor 5
Name:Sphingosine 1-phosphate receptor 5
Type:G Protein-Coupled Receptor (GPCR)
Mol. Mass.:41796.42
Organism:Homo sapiens (Human)
Description:n/a
Residue:398
BDBM50249264
NameBDBM50249264
Synonyms:(S)-2-amino-3-(4-(4-(biphenyl-4-yl)butoxy)phenylamino)-2-methyl-3-oxopropyl dihydrogen phosphate | CHEMBL475253
TypeSmall organic molecule
Emp. Form.C26H31N2O6P
Mol. Mass.498.5079
SMILESC[C@](N)(COP(O)(O)=O)C(=O)Nc1ccc(OCCCCc2ccc(cc2)-c2ccccc2)cc1