Reaction Details
TargetSphingosine 1-phosphate receptor 5
LigandBDBM50249266
Substrate/Competitorn/a
Meas. Tech.ChEMBL_499716 (CHEMBL980651)
IC50 9.6±n/a nM
Citation Evindar, GSatz, ALBernier, SGKavarana, MJDoyle, ELorusso, JTaghizadeh, NHalley, KHutchings, AKelley, MSWright, ADSaha, AKHannig, GMorgan, BAWestlin, WF Synthesis and evaluation of arylalkoxy- and biarylalkoxy-phenylamide and phenylimidazoles as potent and selective sphingosine-1-phosphate receptor subtype-1 agonists. Bioorg Med Chem Lett19:2315-9 (2009) 
 
Sphingosine 1-phosphate receptor 5
Name:Sphingosine 1-phosphate receptor 5
Type:G Protein-Coupled Receptor (GPCR)
Mol. Mass.:41796.42
Organism:Homo sapiens (Human)
Description:n/a
Residue:398
BDBM50249266
NameBDBM50249266
Synonyms:(R)-2-amino-2-(4-(4-(biphenyl-4-ylmethoxy)phenyl)-1H-imidazol-2-yl)propyl dihydrogen phosphate | CHEMBL514170
TypeSmall organic molecule
Emp. Form.C25H26N3O5P
Mol. Mass.479.4648
SMILESC[C@](N)(COP(O)(O)=O)c1nc(c[nH]1)-c1ccc(OCc2ccc(cc2)-c2ccccc2)cc1