Reaction Details
TargetHexokinase-4
LigandBDBM50256776
Substrate/Competitorn/a
Meas. Tech.ChEMBL_566832 (CHEMBL957641)
EC50 19000±n/a nM
Citation Iino, TTsukahara, DKamata, KSasaki, KOhyama, SHosaka, HHasegawa, TChiba, MNagata, YEiki, JNishimura, T Discovery of potent and orally active 3-alkoxy-5-phenoxy-N-thiazolyl benzamides as novel allosteric glucokinase activators. Bioorg Med Chem17:2733-43 (2009) 
 
Hexokinase-4
Name:Hexokinase-4
Type:Enzyme
Mol. Mass.:52175.81
Organism:Homo sapiens (Human)
Description:P35557
Residue:465
BDBM50256776
NameBDBM50256776
Synonyms:CHEMBL474626 | N-(4-Methyl-1,3-thiazol-2-yl)-3-phenoxybenzamide
TypeSmall organic molecule
Emp. Form.C17H14N2O2S
Mol. Mass.310.37
SMILESCc1csc(NC(=O)c2cccc(Oc3ccccc3)c2)n1