Reaction Details
TargetCoagulation factor X
LigandBDBM50249160
Substrate/Competitorn/a
Meas. Tech.ChEMBL_499722 (CHEMBL968695)
IC50 0.9±n/a nM
Citation Zhang, PHuang, WWang, LBao, LJia, ZJBauer, SMGoldman, EAProbst, GDSong, YSu, TFan, JWu, YLi, WWoolfrey, JSinha, UWong, PWEdwards, STArfsten, AEClizbe, LAKanter, JPandey, APark, GHutchaleelaha, ALambing, JLHollenbach, SJScarborough, RMZhu, BY Discovery of betrixaban (PRT054021), N-(5-chloropyridin-2-yl)-2-(4-(N,N-dimethylcarbamimidoyl)benzamido)-5-methoxybenzamide, a highly potent, selective, and orally efficacious factor Xa inhibitor. Bioorg Med Chem Lett19:2179-85 (2009) 
 
Coagulation factor X
Name:Coagulation factor X
Type:Enzyme
Mol. Mass.:54726.60
Organism:Homo sapiens (Human)
Description:n/a
Residue:488
BDBM50249160
NameBDBM50249160
Synonyms:5-chloro-N-(5-chloropyridin-2-yl)-2-(4-(N,N-dimethylcarbamimidoyl)benzamido)-3-(piperidin-1-yl)benzamide | CHEMBL473161
TypeSmall organic molecule
Emp. Form.C27H28Cl2N6O2
Mol. Mass.539.456
SMILESCN(C)C(=N)c1ccc(cc1)C(=O)Nc1c(cc(Cl)cc1C(=O)Nc1ccc(Cl)cn1)N1CCCCC1