Reaction Details
TargetCoagulation factor X
LigandBDBM50249124
Substrate/Competitorn/a
Meas. Tech.ChEMBL_499722 (CHEMBL968695)
IC50 1.2±n/a nM
Citation Zhang, PHuang, WWang, LBao, LJia, ZJBauer, SMGoldman, EAProbst, GDSong, YSu, TFan, JWu, YLi, WWoolfrey, JSinha, UWong, PWEdwards, STArfsten, AEClizbe, LAKanter, JPandey, APark, GHutchaleelaha, ALambing, JLHollenbach, SJScarborough, RMZhu, BY Discovery of betrixaban (PRT054021), N-(5-chloropyridin-2-yl)-2-(4-(N,N-dimethylcarbamimidoyl)benzamido)-5-methoxybenzamide, a highly potent, selective, and orally efficacious factor Xa inhibitor. Bioorg Med Chem Lett19:2179-85 (2009) 
 
Coagulation factor X
Name:Coagulation factor X
Type:Enzyme
Mol. Mass.:54726.60
Organism:Homo sapiens (Human)
Description:n/a
Residue:488
BDBM50249124
NameBDBM50249124
Synonyms:2-(4-(azetidin-1-yl(imino)methyl)benzamido)-5-chloro-N-(5-chloropyridin-2-yl)benzamide | CHEMBL516356
TypeSmall organic molecule
Emp. Form.C23H19Cl2N5O2
Mol. Mass.468.335
SMILESClc1ccc(NC(=O)c2cc(Cl)ccc2NC(=O)c2ccc(cc2)C(=N)N2CCC2)nc1