Reaction Details
TargetPotassium voltage-gated channel subfamily H member 2
LigandBDBM50193849
Substrate/Competitorn/a
Meas. Tech.ChEMBL_499727 (CHEMBL968700)
Ki 200±n/a nM
Citation Zhang, PHuang, WWang, LBao, LJia, ZJBauer, SMGoldman, EAProbst, GDSong, YSu, TFan, JWu, YLi, WWoolfrey, JSinha, UWong, PWEdwards, STArfsten, AEClizbe, LAKanter, JPandey, APark, GHutchaleelaha, ALambing, JLHollenbach, SJScarborough, RMZhu, BY Discovery of betrixaban (PRT054021), N-(5-chloropyridin-2-yl)-2-(4-(N,N-dimethylcarbamimidoyl)benzamido)-5-methoxybenzamide, a highly potent, selective, and orally efficacious factor Xa inhibitor. Bioorg Med Chem Lett19:2179-85 (2009) 
 
Potassium voltage-gated channel subfamily H member 2
Name:Potassium voltage-gated channel subfamily H member 2
Type:Multi-pass membrane protein
Mol. Mass.:126672.65
Organism:Homo sapiens (Human)
Description:Q12809
Residue:1159
BDBM50193849
NameBDBM50193849
Synonyms:CHEMBL219106 N-{2-[(5-chloropyridin-2-yl)carbamoyl]-4-methoxyphenyl}-4-(N,N-dimethylcarbamimidoyl)-2-(piperidin-1-yl)benzamide
TypeSmall organic molecule
Emp. Form.C28H31ClN6O3
Mol. Mass.535.037
SMILESCOc1ccc(NC(=O)c2ccc(cc2N2CCCCC2)C(=N)N(C)C)c(c1)C(=O)Nc1ccc(Cl)cn1