Reaction Details
TargetProto-oncogene tyrosine-protein kinase Src
LigandBDBM50267546
Substrate/Competitorn/a
Meas. Tech.ChEMBL_563100 (CHEMBL1022370)
IC50 89±n/a nM
Citation Lee, KKim, JJeong, KWLee, KWLee, YSong, JYKim, MSLee, GSKim, Y Structure-based virtual screening of Src kinase inhibitors. Bioorg Med Chem17:3152-61 (2009) 
 
Proto-oncogene tyrosine-protein kinase Src
Name:Proto-oncogene tyrosine-protein kinase Src
Type:Protein
Mol. Mass.:59838.60
Organism:Homo sapiens (Human)
Description:P12931
Residue:536
BDBM50267546
NameBDBM50267546
Synonyms:(S)-N-(4-(5-chlorobenzo[d][1,3]dioxol-4-ylamino)-7-(2-methoxyethoxy)quinazolin-6-yl)pyrrolidine-2-carboxamide | CHEMBL523122
TypeSmall organic molecule
Emp. Form.C23H24ClN5O5
Mol. Mass.485.92
SMILESCOCCOc1cc2ncnc(Nc3c4OCOc4ccc3Cl)c2cc1NC(=O)[C@@H]1CCCN1