Reaction Details
TargetProto-oncogene tyrosine-protein kinase Src
LigandBDBM50267618
Substrate/Competitorn/a
Meas. Tech.ChEMBL_563100 (CHEMBL1022370)
IC50 300±n/a nM
Citation Lee, KKim, JJeong, KWLee, KWLee, YSong, JYKim, MSLee, GSKim, Y Structure-based virtual screening of Src kinase inhibitors. Bioorg Med Chem17:3152-61 (2009) 
 
Proto-oncogene tyrosine-protein kinase Src
Name:Proto-oncogene tyrosine-protein kinase Src
Type:Protein
Mol. Mass.:59838.60
Organism:Homo sapiens (Human)
Description:P12931
Residue:536
BDBM50267618
NameBDBM50267618
Synonyms:(S)-N-(4-(3-chloro-4-fluorophenylamino)-7-(2-methoxyethoxy)qui-nazolin-6-yl)pyrrolidine-2-carboxamide | CHEMBL485304
TypeSmall organic molecule
Emp. Form.C22H23ClFN5O3
Mol. Mass.459.901
SMILESCOCCOc1cc2ncnc(Nc3ccc(F)c(Cl)c3)c2cc1NC(=O)[C@@H]1CCCN1