Reaction Details
TargetEpidermal growth factor receptor
LigandBDBM50267546
Substrate/Competitorn/a
Meas. Tech.ChEMBL_563101 (CHEMBL1022371)
IC50 7130±n/a nM
Citation Lee, KKim, JJeong, KWLee, KWLee, YSong, JYKim, MSLee, GSKim, Y Structure-based virtual screening of Src kinase inhibitors. Bioorg Med Chem17:3152-61 (2009) 
 
Epidermal growth factor receptor
Name:Epidermal growth factor receptor
Type:Receptor Kinase Domain
Mol. Mass.:134279.59
Organism:Homo sapiens (Human)
Description:P00533
Residue:1210
BDBM50267546
NameBDBM50267546
Synonyms:(S)-N-(4-(5-chlorobenzo[d][1,3]dioxol-4-ylamino)-7-(2-methoxyethoxy)quinazolin-6-yl)pyrrolidine-2-carboxamide | CHEMBL523122
TypeSmall organic molecule
Emp. Form.C23H24ClN5O5
Mol. Mass.485.92
SMILESCOCCOc1cc2ncnc(Nc3c4OCOc4ccc3Cl)c2cc1NC(=O)[C@@H]1CCCN1