Reaction Details
TargetEpidermal growth factor receptor
LigandBDBM13216
Substrate/Competitorn/a
Meas. Tech.ChEMBL_563101 (CHEMBL1022371)
IC50 2870±n/a nM
Citation Lee, KKim, JJeong, KWLee, KWLee, YSong, JYKim, MSLee, GSKim, Y Structure-based virtual screening of Src kinase inhibitors. Bioorg Med Chem17:3152-61 (2009) 
 
Epidermal growth factor receptor
Name:Epidermal growth factor receptor
Type:Receptor Kinase Domain
Mol. Mass.:134279.59
Organism:Homo sapiens (Human)
Description:P00533
Residue:1210
BDBM13216
NameBDBM13216
Synonyms:BMS-354825 DASATINIB N-(2-chloro-6-methylphenyl)-2-({6-[4-(2-hydroxyethyl)piperazin-1-yl]-2-methylpyrimidin-4-yl}amino)-1,3-thiazole-5-carboxamide US20230348453, Compound A8 med.21724, Compound Dasatinib
TypeSmall organic molecule
Emp. Form.C22H26ClN7O2S
Mol. Mass.488.006
SMILESCc1nc(Nc2ncc(s2)C(=O)Nc2c(C)cccc2Cl)cc(n1)N1CCN(CCO)CC1