Reaction Details
TargetXanthine dehydrogenase/oxidase
LigandBDBM35440
Substrate/Competitorn/a
Meas. Tech.ChEMBL_499127 (CHEMBL1011401)
IC50 23500±n/a nM
Citation Gong, JHuang, KWang, FYang, LFeng, YLi, HLi, XZeng, SWu, XStöckigt, JZhao, YQu, J Preparation of two sets of 5,6,7-trioxygenated dihydroflavonol derivatives as free radical scavengers and neuronal cell protectors to oxidative damage. Bioorg Med Chem17:3414-25 (2009) 
 
Xanthine dehydrogenase/oxidase
Name:Xanthine dehydrogenase/oxidase
Type:Enzyme
Mol. Mass.:146441.21
Organism:Homo sapiens (Human)
Description:P47989
Residue:1333
BDBM35440
NameBDBM35440
Synonyms:ALLOPURINOL SMR000059083 | cid_2094
TypeSmall organic molecule
Emp. Form.C5H4N4O
Mol. Mass.136.1115
SMILESO=c1[nH]cnc2n[nH]cc12