Reaction Details
TargetNeutrophil elastase
LigandBDBM50281052
Substrate/Competitorn/a
Meas. Tech.ChEBML_64137
Ki 1500±n/a nM
Citation Thompson, KRFinke, PEShah, SKAshe, BMDahlgren, MEDellea, PSFletcher, DSHand, KMMaycock, ALDoherty, JB Inhibition of human leukocyte elastase. 7. Inhibition by 6-substituted penicillin amides. Bioorg Med Chem Lett3:2289-2294 (1993)    Article
 
Neutrophil elastase
Name:Neutrophil elastase
Type:Enzyme
Mol. Mass.:28532.38
Organism:Homo sapiens (Human)
Description:P08246
Residue:267
BDBM50281052
NameBDBM50281052
Synonyms:(2S,5R,6S)-3,3-Dimethyl-4,7-dioxo-6-(2,2,2-trifluoro-acetylamino)-4lambda*4*-thia-1-aza-bicyclo[3.2.0]heptane-2-carboxylic acid 4-carboxy-benzyl ester | CHEMBL306565
TypeSmall organic molecule
Emp. Form.C18H17F3N2O7S
Mol. Mass.462.397
SMILESCC1(C)[C@@H](N2[C@@H]([C@@H](NC(=O)C(F)(F)F)C2=O)S1=O)C(=O)OCc1ccc(cc1)C(O)=O