Reaction Details
TargetType-1 angiotensin II receptor B
LigandBDBM50282316
Substrate/Competitorn/a
Meas. Tech.ChEMBL_34944 (CHEMBL647787)
Ki 4.6±n/a nM
Citation Lloyd, JRyono, DEBird, JEBuote, JDelaney, CLDejneka, TDickinson, KEMoreland, SNormandin, DESkwish, SSpitzmiller, ERWaldron, TL Quinoline-4-carboxylic acids as angiotensin II receptor antagonists Bioorg Med Chem Lett4:195-200 (1994)    Article
 
Type-1 angiotensin II receptor B
Name:Type-1 angiotensin II receptor B
Type:Enzyme Catalytic Domain
Mol. Mass.:40929.44
Organism:RAT
Description:Angiotensin II AT1B 0 RAT::P29089
Residue:359
BDBM50282316
NameBDBM50282316
Synonyms:2-Cyclopropyl-3-[2'-(2H-tetrazol-5-yl)-biphenyl-4-yloxy]-[1,8]naphthyridine-4-carboxylic acid | CHEMBL418306
TypeSmall organic molecule
Emp. Form.C25H18N6O3
Mol. Mass.450.4488
SMILESOC(=O)c1c(Oc2ccc(cc2)-c2ccccc2-c2nnn[nH]2)c(nc2ncccc12)C1CC1