Reaction Details
TargetType-1 angiotensin II receptor B
LigandBDBM50282317
Substrate/Competitorn/a
Meas. Tech.ChEMBL_34944 (CHEMBL647787)
Ki 12±n/a nM
Citation Lloyd, JRyono, DEBird, JEBuote, JDelaney, CLDejneka, TDickinson, KEMoreland, SNormandin, DESkwish, SSpitzmiller, ERWaldron, TL Quinoline-4-carboxylic acids as angiotensin II receptor antagonists Bioorg Med Chem Lett4:195-200 (1994)    Article
 
Type-1 angiotensin II receptor B
Name:Type-1 angiotensin II receptor B
Type:Enzyme Catalytic Domain
Mol. Mass.:40929.44
Organism:RAT
Description:Angiotensin II AT1B 0 RAT::P29089
Residue:359
BDBM50282317
NameBDBM50282317
Synonyms:2-Cyclopropyl-5-methyl-3-[2'-(2H-tetrazol-5-yl)-biphenyl-4-yloxy]-quinoline-4-carboxylic acid | CHEMBL294500
TypeSmall organic molecule
Emp. Form.C27H21N5O3
Mol. Mass.463.4873
SMILESCc1cccc2nc(C3CC3)c(Oc3ccc(cc3)-c3ccccc3-c3nnn[nH]3)c(C(O)=O)c12