Reaction Details
TargetGag-Pol polyprotein [489-587]
LigandBDBM50283359
Substrate/Competitorn/a
Meas. Tech.ChEMBL_79973 (CHEMBL690411)
Ki 70±n/a nM
Citation Schirlin, DDorsselaer, VVTarnus, CTaylor, DLTyms, ASBaltzer, SWeber, FRemy, JMBrennan, TFarr, RJanowick, D Beneficial replacement of the P1 phenylalanine side chain in HIV-1 protease inhibitors of the difluorostatone type Bioorg Med Chem Lett4:241-246 (1994)    Article
 
Gag-Pol polyprotein [489-587]
Name:Gag-Pol polyprotein [489-587]
Type:Enzyme Subunit
Mol. Mass.:10781.16
Organism:Human immunodeficiency virus type 1
Description:P04585[489-587]
Residue:99
BDBM50283359
NameBDBM50283359
Synonyms:CHEMBL83002 | [(S)-1-(1-Benzyl-3,3-difluoro-4-morpholin-4-yl-2,4-dioxo-butylcarbamoyl)-2-methyl-propyl]-carbamic acid benzyl ester
TypeSmall organic molecule
Emp. Form.C28H33F2N3O6
Mol. Mass.545.5749
SMILESCC(C)[C@H](NC(=O)OCc1ccccc1)C(=O)NC(Cc1ccccc1)C(=O)C(F)(F)C(=O)N1CCOCC1