Reaction Details
TargetcAMP-specific 3',5'-cyclic phosphodiesterase 4B
LigandBDBM50285041
Substrate/Competitorn/a
Meas. Tech.ChEBML_155171
Ki 80±n/a nM
Citation Stafford, JAValvano, NLFeldman, PLBrawley, ESCowan, DJDomanico, PLLeesnitzer, MARose, DAStimpson, SAStrickland, ABUnwalla, RJVerghese, MW Phosphodiesterase type IV (PDE IV) inhibition. Synthesis and evaluation of a series of 1,3,4-trisubstituted pyrrolidines Bioorg Med Chem Lett5:1977-1982 (1995)    Article
 
cAMP-specific 3',5'-cyclic phosphodiesterase 4B
Name:cAMP-specific 3',5'-cyclic phosphodiesterase 4B
Type:Protein
Mol. Mass.:83318.87
Organism:Homo sapiens (Human)
Description:Q07343
Residue:736
BDBM50285041
NameBDBM50285041
Synonyms:CHEMBL301053 | methyl 3-cyano-4-(3-cyclopentyloxy-4-methoxyphenyl)-(3S,4R)-tetrahydro-1H-1-pyrrolecarboxylate
TypeSmall organic molecule
Emp. Form.C19H24N2O4
Mol. Mass.344.4049
SMILESCOC(=O)N1C[C@@H](C#N)[C@@H](C1)c1ccc(OC)c(OC2CCCC2)c1