Reaction Details
TargetcAMP-specific 3',5'-cyclic phosphodiesterase 4B
LigandBDBM50285043
Substrate/Competitorn/a
Meas. Tech.ChEBML_155171
Ki 810±n/a nM
Citation Stafford, JAValvano, NLFeldman, PLBrawley, ESCowan, DJDomanico, PLLeesnitzer, MARose, DAStimpson, SAStrickland, ABUnwalla, RJVerghese, MW Phosphodiesterase type IV (PDE IV) inhibition. Synthesis and evaluation of a series of 1,3,4-trisubstituted pyrrolidines Bioorg Med Chem Lett5:1977-1982 (1995)    Article
 
cAMP-specific 3',5'-cyclic phosphodiesterase 4B
Name:cAMP-specific 3',5'-cyclic phosphodiesterase 4B
Type:Protein
Mol. Mass.:83318.87
Organism:Homo sapiens (Human)
Description:Q07343
Residue:736
BDBM50285043
NameBDBM50285043
Synonyms:CHEMBL61727 | methyl 4-(3-cyclopentyloxy-4-methoxyphenyl)-1-formyl-(3S,4R)-tetrahydro-1H-3-pyrrolecarboxylate
TypeSmall organic molecule
Emp. Form.C19H25NO5
Mol. Mass.347.4055
SMILESCOC(=O)[C@@H]1CN(C[C@H]1c1ccc(OC)c(OC2CCCC2)c1)C=O