Reaction Details
TargetcAMP-specific 3',5'-cyclic phosphodiesterase 4B
LigandBDBM50285058
Substrate/Competitorn/a
Meas. Tech.ChEBML_155171
Ki 14400±n/a nM
Citation Stafford, JAValvano, NLFeldman, PLBrawley, ESCowan, DJDomanico, PLLeesnitzer, MARose, DAStimpson, SAStrickland, ABUnwalla, RJVerghese, MW Phosphodiesterase type IV (PDE IV) inhibition. Synthesis and evaluation of a series of 1,3,4-trisubstituted pyrrolidines Bioorg Med Chem Lett5:1977-1982 (1995)    Article
 
cAMP-specific 3',5'-cyclic phosphodiesterase 4B
Name:cAMP-specific 3',5'-cyclic phosphodiesterase 4B
Type:Protein
Mol. Mass.:83318.87
Organism:Homo sapiens (Human)
Description:Q07343
Residue:736
BDBM50285058
NameBDBM50285058
Synonyms:(3S,4R)-3-tert-Butoxycarbonylamino-4-(3-cyclopentyloxy-4-methoxy-phenyl)-pyrrolidine-1-carboxylic acid methyl ester | CHEMBL294709
TypeSmall organic molecule
Emp. Form.C23H34N2O6
Mol. Mass.434.5259
SMILESCOC(=O)N1C[C@@H](NC(=O)OC(C)(C)C)[C@@H](C1)c1ccc(OC)c(OC2CCCC2)c1