Reaction Details
TargetGag-Pol polyprotein [489-587]
LigandBDBM50285453
Substrate/Competitorn/a
Meas. Tech.ChEBML_79467
IC50 0.180000±n/a nM
Citation Kim, BMGuare, JPVacca, JDMichelson, SRDarke, PLZugay, JAEmini, EASchleif, WLin, JHChen, IWVastag, KAnderson, PSHuff, JR Thiophene derivatives as extremely high affinity P3′ ligands for the hydroxyethylpiperazine class of HIV-1 protease inhibitors Bioorg Med Chem Lett5:185-190 (1995)    Article
 
Gag-Pol polyprotein [489-587]
Name:Gag-Pol polyprotein [489-587]
Type:Enzyme Subunit
Mol. Mass.:10781.16
Organism:Human immunodeficiency virus type 1
Description:P04585[489-587]
Residue:99
BDBM50285453
NameBDBM50285453
Synonyms:CHEMBL292193 | {(1S,2R)-1-Benzyl-3-[(S)-4-(4-bromo-thiophen-2-ylmethyl)-2-tert-butylcarbamoyl-piperazin-1-yl]-2-hydroxy-propyl}-carbamic acid (2R,3R)-2-isopropyl-1,1-dioxo-tetrahydro-1lambda*6*-thiophen-3-yl ester
TypeSmall organic molecule
Emp. Form.C32H47BrN4O6S2
Mol. Mass.727.773
SMILESCC(C)[C@@H]1[C@@H](CCS1(=O)=O)OC(=O)N[C@@H](Cc1ccccc1)[C@H](O)CN1CCN(Cc2cc(Br)cs2)C[C@H]1C(=O)NC(C)(C)C