Reaction Details
TargetPeroxisome proliferator-activated receptor gamma
LigandBDBM50287732
Substrate/Competitorn/a
Meas. Tech.ChEBML_153639
Ki 15±n/a nM
Citation Buckle, DRCantello, BCCawthorne, MACoyle, PJDean, DKFaller, AHaigh, DHindley, RMJefcott, LJLister, CAPinto, ILRami, HKSmith, DGSmith, SA Non thiazolidinedione antihyperglycaemic agents. 1: α-Heteroatom substituted β-phenylpropanoic acids Bioorg Med Chem Lett6:2121-2126 (1996)    Article
 
Peroxisome proliferator-activated receptor gamma
Name:Peroxisome proliferator-activated receptor gamma
Type:Nuclear Receptor
Mol. Mass.:57613.46
Organism:Homo sapiens (Human)
Description:P37231
Residue:505
BDBM50287732
NameBDBM50287732
Synonyms:3-{4-[2-(Benzooxazol-2-yl-methyl-amino)-ethoxy]-phenyl}-2-methoxy-propionic acid | CHEMBL67948
TypeSmall organic molecule
Emp. Form.C20H22N2O5
Mol. Mass.370.3991
SMILESCOC(Cc1ccc(OCCN(C)c2nc3ccccc3o2)cc1)C(O)=O