Reaction Details
TargetSerine protease 1
LigandBDBM50288410
Substrate/Competitorn/a
Meas. Tech.ChEBML_210658
Ki 21±n/a nM
Citation Galemmo, RAFevig, JMCarini, DJCacciola, JWells, BLHillyer, GLJr., JBRossi, KAStouten, PFAlexander, RSHilmer, RBostrom, LAbelman, MMLee, SLWeber, PCKettner, CAKnabb, RMWexler, RR (N-acyl-N-alkyl)glycyl borolysine analogs: A new class of potent thrombin inhibitors Bioorg Med Chem Lett6:2913-2918 (1996)    Article
 
Serine protease 1
Name:Serine protease 1
Type:Enzyme
Mol. Mass.:26557.80
Organism:Homo sapiens (Human)
Description:P07477
Residue:247
BDBM50288410
NameBDBM50288410
Synonyms:CHEMBL95993 | N-[(1-Dihydroxyboranyl-4-formimidoylamino-butylcarbamoyl)-methyl]-N-methyl-3-phenyl-propionamide
TypeSmall organic molecule
Emp. Form.C17H27BN4O4
Mol. Mass.362.232
SMILESCN(CC(=O)N[C@@H](CCCNC=N)B(O)O)C(=O)CCc1ccccc1