Reaction Details
TargetPlasminogen
LigandBDBM50288403
Substrate/Competitorn/a
Meas. Tech.ChEBML_155601
Ki 140±n/a nM
Citation Galemmo, RAFevig, JMCarini, DJCacciola, JWells, BLHillyer, GLJr., JBRossi, KAStouten, PFAlexander, RSHilmer, RBostrom, LAbelman, MMLee, SLWeber, PCKettner, CAKnabb, RMWexler, RR (N-acyl-N-alkyl)glycyl borolysine analogs: A new class of potent thrombin inhibitors Bioorg Med Chem Lett6:2913-2918 (1996)    Article
 
Plasminogen
Name:Plasminogen
Type:Enzyme
Mol. Mass.:90579.18
Organism:Homo sapiens (Human)
Description:n/a
Residue:810
BDBM50288403
NameBDBM50288403
Synonyms:CHEMBL330206 | N-[(5-Amino-1-dihydroxyboranyl-pentylcarbamoyl)-methyl]-N-isopropyl-3-phenyl-propionamide
TypeSmall organic molecule
Emp. Form.C19H32BN3O4
Mol. Mass.377.286
SMILESCC(C)N(CC(=O)N[C@@H](CCCCN)B(O)O)C(=O)CCc1ccccc1