Reaction Details
TargetProthrombin
LigandBDBM50288411
Substrate/Competitorn/a
Meas. Tech.ChEBML_208357
Ki 16±n/a nM
Citation Galemmo, RAFevig, JMCarini, DJCacciola, JWells, BLHillyer, GLJr., JBRossi, KAStouten, PFAlexander, RSHilmer, RBostrom, LAbelman, MMLee, SLWeber, PCKettner, CAKnabb, RMWexler, RR (N-acyl-N-alkyl)glycyl borolysine analogs: A new class of potent thrombin inhibitors Bioorg Med Chem Lett6:2913-2918 (1996)    Article
 
Prothrombin
Name:Prothrombin
Type:Protein
Mol. Mass.:70029.57
Organism:Homo sapiens (Human)
Description:P00734
Residue:622
BDBM50288411
NameBDBM50288411
Synonyms:CHEMBL100187 | N-[(5-Amino-1-dihydroxyboranyl-pentylcarbamoyl)-methyl]-N-methyl-2-phenyl-acetamide
TypeSmall organic molecule
Emp. Form.C16H26BN3O4
Mol. Mass.335.206
SMILESCN(CC(=O)N[C@@H](CCCCN)B(O)O)C(=O)Cc1ccccc1