Reaction Details
TargetPlasminogen
LigandBDBM50069174
Substrate/Competitorn/a
Meas. Tech.ChEBML_155601
Ki 250±n/a nM
Citation Galemmo, RAFevig, JMCarini, DJCacciola, JWells, BLHillyer, GLJr., JBRossi, KAStouten, PFAlexander, RSHilmer, RBostrom, LAbelman, MMLee, SLWeber, PCKettner, CAKnabb, RMWexler, RR (N-acyl-N-alkyl)glycyl borolysine analogs: A new class of potent thrombin inhibitors Bioorg Med Chem Lett6:2913-2918 (1996)    Article
 
Plasminogen
Name:Plasminogen
Type:Enzyme
Mol. Mass.:90579.18
Organism:Homo sapiens (Human)
Description:n/a
Residue:810
BDBM50069174
NameBDBM50069174
Synonyms:Boronate Ester analogue N-[(5-Amino-1-dihydroxyboranyl-pentylcarbamoyl)-methyl]-N-methyl-3-phenyl-propionamide
TypeSmall organic molecule
Emp. Form.C17H28BN3O4
Mol. Mass.349.233
SMILESCN(CC(=O)N[C@@H](CCCCN)B(O)O)C(=O)CCc1ccccc1