Reaction Details
TargetPeptidyl-prolyl cis-trans isomerase FKBP1A
LigandBDBM50288763
Substrate/Competitorn/a
Meas. Tech.ChEBML_195891
Ki 1200±n/a nM
Citation Babine, REBleckman, TMLittlefield, ESParge, HEPelletier, LALewis, CTFrench, JVImbacuan, MKatoh, STatlock, JHShowalter, REVillafranca, JE Design, synthesis and X-ray crystallographic studies of [7.3.1] and [8.3.1] macrocyclic FKBP-12 ligands Bioorg Med Chem Lett6:385-390 (1996)    Article
 
Peptidyl-prolyl cis-trans isomerase FKBP1A
Name:Peptidyl-prolyl cis-trans isomerase FKBP1A
Type:Isomerase
Mol. Mass.:11953.09
Organism:Homo sapiens (Human)
Description:P62942
Residue:108
BDBM50288763
NameBDBM50288763
Synonyms:(1S,9R)-5-Benzyloxymethyl-13-[2-oxo-2-(3,4,5-trimethoxy-phenyl)-acetyl]-3,7-dioxa-13-aza-bicyclo[7.3.1]tridecane-2,8-dione | CHEMBL276123
TypeSmall organic molecule
Emp. Form.C29H33NO10
Mol. Mass.555.573
SMILESCOc1cc(cc(OC)c1OC)C(=O)C(=O)N1[C@@H]2CCC[C@H]1C(=O)OCC(COCc1ccccc1)COC2=O