Reaction Details
TargetComplement C1r subcomponent
LigandBDBM50288999
Substrate/Competitorn/a
Meas. Tech.ChEMBL_40172 (CHEMBL655967)
IC50>62500±n/a nM
Citation Gilmore, JLHays, SJCaprathe, BWLee, CEmmerling, MRMichael, WJaen, JC Synthesis and evaluation of 2-aryl-4H-3,1-benzoxazin-4-ones as C1r serine protease inhibitors Bioorg Med Chem Lett6:679-682 (1996)    Article
 
Complement C1r subcomponent
Name:Complement C1r subcomponent
Type:Enzyme
Mol. Mass.:80113.65
Organism:Homo sapiens (Human)
Description:P00736
Residue:705
BDBM50288999
NameBDBM50288999
Synonyms:2-(2-Iodo-phenyl)-7-methyl-benzo[d][1,3]oxazin-4-one | CHEMBL345362
TypeSmall organic molecule
Emp. Form.C15H10INO2
Mol. Mass.363.1499
SMILESCc1ccc2c(c1)nc(oc2=O)-c1ccccc1I