Reaction Details
TargetAcetylcholinesterase
LigandBDBM10972
Substrate/Competitorn/a
Meas. Tech.ChEMBL_29079 (CHEMBL636453)
IC50 9±n/a nM
Citation Martin, LLDavis, LKlein, JTNemoto, POlsen, GEBores, GMCamacho, FPetko, WWRush, DKSelk, DSmith, CPVargas, HMWinslow, JTEffland, RCFink, DM Synthesis and preliminary structure-activity relationships of 1-[(3-fluoro-4-pyridinyl)amino]-3-methyl-1H-indol-5-yl methyl carbamate (P10358), a novel acetylcholinesterase inhibitor Bioorg Med Chem Lett7:157-162 (1997)    Article
 
Acetylcholinesterase
Name:Acetylcholinesterase
Type:Enzyme
Mol. Mass.:68193.62
Organism:Rattus norvegicus (rat)
Description:P37136
Residue:614
BDBM10972
NameBDBM10972
Synonyms:(3aS,8aR)-1,3a,8-trimethyl-1H,2H,3H,3aH,8H,8aH-pyrrolo[2,3-b]indol-5-yl N-heptylcarbamate Eptastigmine | Heptylphysostigmine
TypeSmall organic molecule
Emp. Form.C21H33N3O2
Mol. Mass.359.5056
SMILES[H][C@]12N(C)CC[C@@]1(C)c1cc(OC(=O)NCCCCCCC)ccc1N2C