Reaction Details
TargetPlatelet-derived growth factor receptor beta
LigandBDBM50290841
Substrate/Competitorn/a
Meas. Tech.ChEBML_177425
IC50 1500±n/a nM
Citation Kubo, KShimizu, TOhyama, SiMurooka, HNishitoba, TKato, SKobayashi, YYagi, MIsoe, TNakamura, KOsawa, TIzawa, T A novel series of 4-phenoxyquinolines: potent and highly selective inhibitors of PDGF receptor autophosphorylation Bioorg Med Chem Lett7:2935-2940 (1997)    Article
 
Platelet-derived growth factor receptor beta
Name:Platelet-derived growth factor receptor beta
Type:PROTEIN
Mol. Mass.:122794.58
Organism:Rattus norvegicus
Description:ChEMBL_177425
Residue:1097
BDBM50290841
NameBDBM50290841
Synonyms:4-(3-Fluoro-phenoxy)-6,7-dimethoxy-quinoline | CHEMBL102191
TypeSmall organic molecule
Emp. Form.C17H14FNO3
Mol. Mass.299.2964
SMILESCOc1cc2nccc(Oc3cccc(F)c3)c2cc1OC