Reaction Details
TargetPlatelet-derived growth factor receptor beta
LigandBDBM50290848
Substrate/Competitorn/a
Meas. Tech.ChEBML_177425
IC50 600±n/a nM
Citation Kubo, KShimizu, TOhyama, SiMurooka, HNishitoba, TKato, SKobayashi, YYagi, MIsoe, TNakamura, KOsawa, TIzawa, T A novel series of 4-phenoxyquinolines: potent and highly selective inhibitors of PDGF receptor autophosphorylation Bioorg Med Chem Lett7:2935-2940 (1997)    Article
 
Platelet-derived growth factor receptor beta
Name:Platelet-derived growth factor receptor beta
Type:PROTEIN
Mol. Mass.:122794.58
Organism:Rattus norvegicus
Description:ChEMBL_177425
Residue:1097
BDBM50290848
NameBDBM50290848
Synonyms:6,7-Dimethoxy-4-(2-methoxy-phenoxy)-quinoline | CHEMBL415501
TypeSmall organic molecule
Emp. Form.C18H17NO4
Mol. Mass.311.3319
SMILESCOc1ccccc1Oc1ccnc2cc(OC)c(OC)cc12