Reaction Details
TargetPlatelet-derived growth factor receptor beta
LigandBDBM50290834
Substrate/Competitorn/a
Meas. Tech.ChEBML_158665
IC50 30±n/a nM
Citation Kubo, KShimizu, TOhyama, SiMurooka, HNishitoba, TKato, SKobayashi, YYagi, MIsoe, TNakamura, KOsawa, TIzawa, T A novel series of 4-phenoxyquinolines: potent and highly selective inhibitors of PDGF receptor autophosphorylation Bioorg Med Chem Lett7:2935-2940 (1997)    Article
 
Platelet-derived growth factor receptor beta
Name:Platelet-derived growth factor receptor beta
Type:Enzyme
Mol. Mass.:123922.25
Organism:Homo sapiens (Human)
Description:P09619
Residue:1106
BDBM50290834
NameBDBM50290834
Synonyms:4-(3,4-Dimethoxy-phenoxy)-6,7-dimethoxy-quinoline | CHEMBL327300
TypeSmall organic molecule
Emp. Form.C19H19NO5
Mol. Mass.341.3579
SMILESCOc1ccc(Oc2ccnc3cc(OC)c(OC)cc23)cc1OC